{"text_format":"3","workbook":"xlsx","n_sheets":8,"sheets":["Анкета","Титульный","Спецификация","Схема","Формулы","Названия","Логика показа элементов","Версии"],"not_rendered":{"images":27,"macros":1,"external_links":2,"defined_names":13},"read":"whole","date_system":"1900"}

{"sheet":"Анкета","index":0,"n_rows":46,"n_cols":6,"rows_kept":46,"merged":[[15,1,15,2],[16,1,16,2]]}
[null,"Для создания спецификации по автоматике для котлов серий "]
[null,"Luna Duo Tec+, Duo Tec Compact, Luna-3, Eco Four, Eco-4s"]
[null,"разрешите запуск макросов и ответьте на предложенные"]
[null,"вопросы, выбрав требуемые значения в закрашенных ячейках"]
[]
[null,"ВОПРОСЫ","ВАШ ВЫБОР"]
[1,"Выберите одну из предложенных серий котлов","LUNA_DUO_TEC_E"]
[2,"Выберите конкретную модель (для установки в каскаде рекомендуем выбирать одноконтурные модели)","LUNA DUO-TEC E 1.28"]
[3,"Укажите количество котлов",1]
[null,"Итоговая максимальная мощность составляет",{"$f":"Формулы!C19","v":"28 кВт"}]
[]
[4,"Укажите планируемое количество прямых независимых контуров ",2,null,null,{"$f":"Формулы!A22","v":""}]
[5,"Укажите планируемое количество независимых контуров со смесительными узлами (радиаторных или низкотемпературных).\nОбратите внимание: максимальное количество прямых и смесительных контуров, рассчитываемых в данном файле, не более четырех.",2,null,null,{"$f":"Формулы!A22","v":""}]
[6,"Нужен ли бойлер для горячего водоснабжения?","Да"]
[]
[null,"Далее зайдите в имеющиеся вкладки  \"Спецификация\" и \"Схема\""]
[null,"и ознакомьтесь со спецификацией и схемой"]
[]
[]
[]
[]
[null,"Информация для титульного листа."]
[]
[null,"Дата:"]
[null,"Не указано"]
[]
[null,"Кому (Организация, ФИО, должность, телефон и т. д.)"]
[null,"Не указано"]
[]
[]
[]
[]
[null,"От кого (Организация, ФИО, должность и т. д.)"]
[null,"Не указано"]
[]
[]
[]
[]
[null,"Адрес объекта"]
[null,"Не указано"]
[]
[]
[]
[]
[null,"Дополнительные примечания"]
[null,"Не указано"]

{"sheet":"Титульный","index":1,"n_rows":41,"n_cols":3,"rows_kept":41,"merged":[[9,0,9,8],[11,0,11,8],[14,2,14,3],[40,1,40,7]]}
{"$rows_empty":9}
["ТЕХНИКО-КОММЕРЧЕСКОЕ ПРЕДЛОЖЕНИЕ"]
[]
["ПО КОТЕЛЬНОМУ ОБОРУДОВАНИЮ BAXI"]
[]
[]
[null,"Дата:",{"$f":"Анкета!B25","v":"Не указано"}]
[]
["Кому (Организация, ФИО, должность и т. д.)"]
[{"$f":"IF(Анкета!B28=\"\",\"\",Анкета!B28)","v":"Не указано"}]
[{"$f":"IF(Анкета!B29=\"\",\"\",Анкета!B29)","v":""}]
[{"$f":"IF(Анкета!B30=\"\",\"\",Анкета!B30)","v":""}]
[{"$f":"IF(Анкета!B31=\"\",\"\",Анкета!B31)","v":""}]
[]
["От кого (Организация, ФИО, должность и т. д.)"]
[{"$f":"IF(Анкета!B34=\"\",\"\",Анкета!B34)","v":"Не указано"}]
[{"$f":"IF(Анкета!B35=\"\",\"\",Анкета!B35)","v":""}]
[{"$f":"IF(Анкета!B36=\"\",\"\",Анкета!B36)","v":""}]
[{"$f":"IF(Анкета!B37=\"\",\"\",Анкета!B37)","v":""}]
[]
["Адрес объекта"]
[{"$f":"IF(Анкета!B40=\"\",\"\",Анкета!B40)","v":"Не указано"}]
[{"$f":"IF(Анкета!B41=\"\",\"\",Анкета!B41)","v":""}]
[{"$f":"IF(Анкета!B42=\"\",\"\",Анкета!B42)","v":""}]
[{"$f":"IF(Анкета!B43=\"\",\"\",Анкета!B43)","v":""}]
[]
["Дополнительные примечания"]
[{"$f":"IF(Анкета!B46=\"\",\"\",Анкета!B46)","v":"Не указано"}]
[{"$f":"IF(Анкета!B47=\"\",\"\",Анкета!B47)","v":""}]
[{"$f":"IF(Анкета!B48=\"\",\"\",Анкета!B48)","v":""}]
[{"$f":"IF(Анкета!B49=\"\",\"\",Анкета!B49)","v":""}]
[]
[null,"Цены  в предложении являются базовыми (без скидок). Окончательная цена на оборудование формируется поставщиком."]

{"sheet":"Спецификация","index":2,"n_rows":68,"n_cols":6,"rows_kept":68,"merged":[[0,0,0,4],[1,0,1,4],[31,0,31,4],[43,0,43,4],[45,1,45,3],[46,1,46,3],[47,1,47,3],[48,1,48,3],[49,1,49,3],[50,1,50,3],[52,0,52,4],[53,0,53,4],[54,0,54,4],[55,0,55,4],[57,0,57,4],[58,0,58,4],[60,3,60,4],[61,3,61,4],[62,3,62,4],[63,3,63,4],[64,3,64,4],[65,3,65,4],[66,3,66,4],[67,3,67,4]]}
[{"$f":"IF(Анкета!C12+Анкета!C13>4,\"ВНИМАНИЕ! Спецификация подобрана некорректно, так как данный конструктор запрограммирован суммарно до четырех контуров.\",\"\")","v":""}]
["Выбранное оборудование"]
["Наименование","Код для заказа","Кол-во, штук","Цена, евро","Стоимость, евро"]
["LUNA DUO-TEC E 1.12",7720022,{"$f":"F4","v":0},1504,{"$f":"D4*F4","v":0},{"$f":"Названия!D3","v":0}]
["LUNA DUO-TEC E 1.24",7720023,{"$f":"F5","v":0},1513,0,{"$f":"Названия!D4","v":0}]
["LUNA DUO-TEC E 1.28",7720024,1,1643,1643,{"$f":"Названия!D5","v":1}]
["LUNA DUO-TEC E 24",7720025,0,1620,0,{"$f":"Названия!D6","v":0}]
["LUNA DUO-TEC E 28",7720026,0,1739,0,{"$f":"Названия!D7","v":0}]
["LUNA DUO-TEC E 33",7720027,0,1816,0,{"$f":"Названия!D8","v":0}]
["LUNA DUO-TEC E 40",7720028,0,1957,0,{"$f":"Названия!D9","v":0}]
["DUO-TEC COMPACT 1.24","A7722037",0,1298,0,{"$f":"Названия!D10","v":0}]
["DUO-TEC COMPACT 24","A7722038",0,1400,0,{"$f":"Названия!D11","v":0}]
["DUO-TEC COMPACT 28","A7722039",0,1416,0,{"$f":"Названия!D12","v":0}]
["LUNA-3 1.310 Fi","CSB45531366",0,1226,0,{"$f":"Названия!D13","v":0}]
["LUNA-3 240 i","CSB45224366",0,1154,0,{"$f":"Названия!D14","v":0}]
["LUNA-3 240 Fi","CSB45624366",0,1289,0,{"$f":"Названия!D15","v":0}]
["LUNA-3 280 Fi","CSE45628366",0,1393,0,{"$f":"Названия!D16","v":0}]
["LUNA-3 310 Fi","CSB45631366",0,1425,0,{"$f":"Названия!D17","v":0}]
["ECO Four 1.14","CSE46114354",0,849,0,{"$f":"Названия!D18","v":0}]
["ECO Four 1.14 F","CSE46514354",0,910,0,{"$f":"Названия!D19","v":0}]
["ECO Four 1.24","CSE46124354",0,861,0,{"$f":"Названия!D20","v":0}]
["ECO Four 1.24 F","CSE46524354",0,961,0,{"$f":"Названия!D21","v":0}]
["ECO Four 24","CSE46224354",0,983,0,{"$f":"Названия!D22","v":0}]
["ECO Four 24 F","CSE46624354",0,1096,0,{"$f":"Названия!D23","v":0}]
["ECO-4s 1.24 F","7659666",0,848,0,{"$f":"Названия!D24","v":0}]
["ECO-4s 10 F","7659668",0,845,0,{"$f":"Названия!D25","v":0}]
["ECO-4s 18 F","7659669",0,880,0,{"$f":"Названия!D26","v":0}]
["ECO-4s 24","7659762",0,848,0,{"$f":"Названия!D27","v":0}]
["ECO-4s 24 F","7659670",0,912,0,{"$f":"Названия!D28","v":0}]
["ИТОГО по оборудованию","Итого, штук",{"$f":"SUM(C4:C29)","v":1},"Итого, евро:",{"$f":"SUM(E4:E29)","v":1643},1]
[{"$nulls":5},1]
["Требуемые аксессуары для управления",{"$nulls":4},1]
["Наименование","Код для заказа","Кол-во, штук","Цена, евро","Стоимость, евро",1]
["QAC 34 - Датчик уличной температуры для конденсационных котлов (для традиционных котлов следует заказывать артикул KHG71406211-)","7104873--",1,32,{"$f":"D34*F34","v":32},{"$f":"Формулы!M5","v":1}]
["Датчик уличной температуры для традиционных котлов ","KHG71406211-",0,23,0,{"$f":"Формулы!N5","v":0}]
["MLC 27 - Каскадный регулятор ","7683469--",0,377,0,{"$f":"Формулы!O5","v":0}]
["MLC 30 - Внешний модуль для подключения дополнительных контуров  ","7109320--",1,183,183,{"$f":"Формулы!P5","v":1}]
["MLC 16 - Внешний модуль для управления смесительным контуром ","7110415--",1,202,202,{"$f":"Формулы!Q5","v":1}]
["PRTS - Датчик комнатной температуры с програмированием климатических параметров ","7104336--",4,90,360,{"$f":"Формулы!R5","v":4}]
["QAD 36 - Накладной датчик температуры теплоносителя","KHG71407891-",1,30,30,{"$f":"Формулы!T5","v":1}]
["QAZ 36 - Датчик температуры воды контура ГВС  для конденсационных котлов","KHG71407681-",1,9,9,{"$f":"Формулы!S5","v":1}]
["Каскадный регулятор MLC27.20","7683469--",0,377,0,0]
["Итого","Итого, штук:",{"$f":"SUM(C34:C42)","v":9},"Итого, евро:",{"$f":"SUM(E34:E42)","v":816}]
[]
["Заданные параметры для подбора."]
["Модель котла",{"$f":"Анкета!C8","v":"LUNA DUO-TEC E 1.28"}]
["Количество котлов",{"$f":"Анкета!C9","v":1}]
["Количество прямых независимых контуров",{"$f":"Анкета!C12","v":2}]
["Количество независимых смесительных контуров (радиаторных или низкотемпературных)",{"$f":"Анкета!C13","v":2}]
["Наличие бойлера для горячего водоснабжения",{"$f":"Анкета!C14","v":"Да"}]
["Итоговая максимальная мощность составляет",{"$f":"Анкета!C10","v":"28 кВт"}]
["Примечания."]
["1. Допускается замена датчика комнатной температуры (артикул 7104336--) на какой-либо комнатный термостат. (Комнатный механический термостат – артикул KHG 71408691-.\nКомнатный механический термостат SIEMENS - артикул KHG 71406281. Комнатный программируемый недельный термостат – артикул KHG 71408671-)"]
["2. В спецификацию не включаются трехходовые клапаны (смесительный клапан, резьба G1/2\" - артикул KHG 71407861-, смесительный клапан, резьба G 3/4\" - артикул KHG 71407871-, смесительный клапан, резьба G1\" - артикул KHG 71407831-) и моторы трехходовых клапанов (артикул KHG 71407851). При необходимости добавьте их самостоятельно."]
["3. В спецификации указаны рекомендованные розничные цены. Для получения точного коммерческого предложения необходимо обращаться в торговые организации. Со списком торговых организаций можно ознакомиться на сайте baxi.ru "]
["4. Для неконденсационных котлов (серии ECO-4s, Eco Four и Luna-3) на схеме условно вместо датчика уличной температуры c артикулом \"KHG71406211-\" изображен датчик уличной температуры QAC 34 (артикул 7104873--). По желанию можно вообще не использовать погодозависимое управление."]
[]
["Общее описание аксессуаров, используемых для управления котлами серий "]
["Luna Duo Tec+, Duo Tec Compact, Luna-3, Eco Four, Eco-4s"]
[]
[" Описание, принцип действия и т.д.","Код для заказа","Цена,\nЕвро","Фото"]
["QAC 34 - Датчик уличной температуры для конденсационных котлов. При использовании датчика температуры воды в системе отопления автоматически изменяется в зависимости от температуры воздуха на улице (подробнее см. инструкции по установке и эксплуатации на котлы). ","7104873--",32]
["MLC 27 - Климатический регулятор для соединения в каскад до 6 котлов. В комплекте поставки присутствует один накладной датчик температуры QAD 36. По низковольтной OpenTherm-шине управляет мощностью котлов. Силовая часть 220В, контакты датчиков и управляющие аналоговые контакты – не более 12В. ","7683469--",377]
["MLC 30 - Разветвитель сигнала шины Opentherm 4x1. Позволяет управлять 4-мя прямыми отопительными контурами. Имеет 4 выхода Opentherm, к которым можно подключить другие модули MLC 30 и MLC 16. Имеет 4 силовых выхода для управления насосами. Силовая часть 220В, контакты датчиков и управляющие аналоговые контакты – не более 12В. ","7109320--",183]
["MLC 16 - Модуль расширения для управления двумя смесительными контурами. Подключается к котлу через MLC 30. Силовая часть 220В, контакты датчиков и управляющие аналоговые контакты – не более 12В. ","7110415--",202]
["PRTS - Датчик комнатной температуры с програмированием климатических параметров. Регулирует температуру на подающей линии теплоносителя от котла таким образом, чтобы подерживать заданую пользователем температуру в помещении.","7104336--",90]
["QAZ 36 - Датчик температуры воды контура ГВС. Датчик температуры – терморезистор. Используется только для подключения внешнего бойлера к одноконтурным котлам.","KHG71407681-",9]
["QAD 36 - Накладной датчик температуры теплоносителя. Датчик используется для контроля температуры в на гидравлическом разделителе или в смесительном контуре. Датчик крепится на трубе. ","KHG71407891-",30]

{"sheet":"Схема","index":3,"n_rows":7,"n_cols":17,"rows_kept":7}
[]
[{"$f":"IF(Анкета!C12+Анкета!C13>4,\"ВНИМАНИЕ! Схема построена некорректно, так как данный конструктор запрограммирован суммарно до четырех контуров.\",\"\")","v":""}]
[]
[]
[]
[null,{"$f":"Формулы!BN5","v":0},{"$f":"Формулы!BO5","v":0},{"$f":"Формулы!BP5","v":0},{"$f":"Формулы!BQ5","v":0},{"$f":"Формулы!BR5","v":0},{"$f":"Формулы!BS5","v":1},{"$f":"Формулы!BT5","v":1},{"$f":"Формулы!BU5","v":1},{"$f":"Формулы!BV5","v":0},{"$f":"Формулы!BW5","v":0},{"$f":"Формулы!BX5","v":0},{"$f":"Формулы!BY5","v":0},{"$f":"Формулы!BZ5","v":0},{"$f":"Формулы!CA5","v":0},{"$f":"Формулы!CB5","v":1},{"$f":"Формулы!CC5","v":0}]
[null,1,2,3,4,5,6,7,8,9,10,11,12,13,14,15,16]

{"sheet":"Формулы","index":4,"n_rows":2883,"n_cols":125,"rows_kept":2883,"hidden":true,"merged":[[1,12,1,19],[1,64,1,80],[2,0,2,7],[7,0,7,3]]}
[1,2,3,4,5,6,7,8,9,10,11,12,13,null,14,15,16,17,18,19,20,21,22,23,24,25,26,27,28,29,30,31,32,33,34,35,36,37,38,39,40,41,42,43,44,45,46,47,48,49,50,51,52,53,54,55,56,57,58,59,60,61,62,63,64,65,66,67,68,69,70,71,72,73,74,75,76,77,78,79,80,81,82,83,84,85,86,87,88,89,90,91,92,93,94,95,96,97,98,99,100,101,102,103,104,105,106,107,108,109,110,111,112,113,114,115,116,117,118,119,120,121,122,123,124]
[{"$nulls":12},"Результаты подбора аксессуаров",{"$nulls":9},"QAC 34 ","QAZ 36","QAD 36","OCI 345 ","AVS 75 ","RVS 46 - ","QAA 75 ","QAA 55","AVS 75 (Broetje)","Имя19","Имя20","Имя21","Имя22","Имя23","Имя24","Имя25","Имя26","Имя27","Имя28","Имя29","Имя30","Имя31","Имя32","Имя33","Имя34","Имя35","Имя36","Имя37","Имя38","Имя39","Имя40","Имя41","Имя42","Имя43","Имя44","Имя45","Имя46","Имя47","Имя48","Имя49","Имя50",null,"Номера элементов схем и имена файлов bertelli (1-показывать на схеме)"]
["Перенос введенных данных",{"$nulls":10},"Имя","QAC 34 ","Датчик улич темп","MLC 27","MLC 30","MLC 16","RTS","QAZ 36","QAD 36",null,null,"7104873--","KHG71407681-","KHG71407891-","7104408--","7105037--","7105199-","7102442--","7101061--","LSX71000003-",{"$nulls":33},"Номер элемента",1,2,3,4,5,6,7,8,9,10,11,12,13,14,15,16]
["Наличие высоко-темп. контура","Наличие бойлера","Номер\nгруппы серий","кол-во котлов в каскаде","кол-во прямых контуров","Макс кол-во смесит. контуров","Наличие высоко-темп. контура - оцифровка","Наличие бойлера - оцифровка",{"$nulls":3},"Код/\nкол-во","7104873--","KHG71406211-","7683469--","7109320--","7110415--","7104347--","KHG71407681-","KHG71407891-",{"$nulls":44},"Имя\nэлемента","101bertelli-WHB","102bertelli&MLC30","103bertelli-N-WHB","104bertelli-N-WHB&MLC30","105a-bertelli-WHB&tank","105bertelli&-WHB&tank&MLC30","106bertelli-direct","106bertelli-direct","106bertelli-direct","106bertelli-direct","107bertelli-direct-final","108bertelli-mix1","109bertelli-mix1-final","110bertelli-mix2","111bertelli-mix2-final","112bertelli-tank"]
["Нет",{"$f":"Анкета!C14","v":"Да"},5,{"$f":"Анкета!C9","v":1},{"$f":"Анкета!C12","v":2},{"$f":"Анкета!C13","v":2},0,{"$f":"IF(B5=\"Да\", 1,IF(B5=\"Нет\",0, \"Ошибка\"))","v":1},{"$nulls":4},{"$f":"IF(OR(Анкета!C7=\"LUNA_DUO_TEC_E\",Анкета!C7=\"DUO_TEC_COMPACT\"),1,0)","v":1},{"$f":"IF(OR(Анкета!C7=\"LUNA_DUO_TEC_E\",Анкета!C7=\"DUO_TEC_COMPACT\"),0,1)","v":0},{"$f":"IF(D5=1,0,1)","v":0},{"$f":"IF(E5+F5<2,0,1)","v":1},{"$f":"IF(F5>0,1,0)","v":1},{"$f":"E5+F5","v":4},{"$f":"H5","v":1},{"$f":"IF(F5=1,F5-Q5,IF(F5>1,O5+F5-Q5,\"Ошибка ввода данных\"))","v":1},{"$nulls":44},"Показывать\nна схеме",{"$f":"IF(AND(D5=1,P5=0,H5=0),1,0)","v":0},{"$f":"IF(AND(D5=1,P5=1,H5=0),1,0)","v":0},{"$f":"IF(AND(D5>1,P5=0),1,0)","v":0},{"$f":"IF(AND(D5>1,P5=1),1,0)","v":0},{"$f":"IF(AND(D5=1,P5=0,H5=1),1,0)","v":0},{"$f":"IF(AND(D5=1,P5=1,H5=1),1,0)","v":1},{"$f":"IF(OR(AND(D5=1,E5>0, E5+F5>1),AND(D5>1,E5>0, E5+F5+H5>1)),1,0)","v":1},{"$f":"IF(OR(AND(D5=1,E5>1,E5+F5>2),AND(D5>1,E5>1,E5+F5+H5>2)),1,0)","v":1},{"$f":"IF(OR(AND(D5=1,E5>2,E5+F5>3),AND(D5>1,E5>2,E5+F5+H5>3)),1,0)","v":0},{"$f":"IF(OR(AND(D5=1,E5=4,F5>0),AND(D5>1,E5=4,F5+H5>0)),1,0)","v":0},{"$f":"IF(OR(AND(D5=1,E5>0,F5=0),AND(D5>1,E5>0,F5+H5=0)),1,0)","v":0},{"$f":"IF(AND(D5>1,F5=1,H5=1),1,0)","v":0},{"$f":"IF(OR(AND(D5=1,F5=1),AND(D5>1,F5=1,H5=0)),1,0)","v":0},{"$f":"IF(AND(D5>1,F5=2,H5=1),1,0)","v":0},{"$f":"IF(OR(AND(D5=1,F5=2),AND(D5>1,F5=2,H5=0)),1,0)","v":1},{"$f":"IF(AND(D5>1,H5=1),1,0)","v":0}]
[]
[]
["Варианты выбора"]
["кол-во котлов в каскаде","кол-во прямых контуров","Макс кол-во смесит. контуров","Наличие бойлера"]
[1,0,0,"Да"]
[2,1,1,"Нет"]
[3,2,2]
[4,3]
[5,4]
[6]
[]
[]
["Вычисленная мощность"]
[{"$f":"VLOOKUP(Анкета!C8,Названия!A3:C28,3,0)*Анкета!C9","v":28},"кВт",{"$f":"CONCATENATE(A19,\" \",B19)","v":"28 кВт"}]
[]
["Предупреждение, что контуров не более четырех"]
[{"$f":"IF(Анкета!C12+Анкета!C13>4,\"Макс. количество всех контуров \nне должно превышать 4\", \"\")","v":""}]
{"$rows_empty":701}
[{"$nulls":22},1,{"$f":"H724","v":0},{"$f":"IF(D724=1,0,IF(D724>1,2,0))","v":0},{"$f":"IF(D724>1,D724,IF(D724=1,IF(E724+F724+G724<4,0,IF(E724+F724+G724>3,1,0))))","v":false},5,5,{"$f":"IF(AA724=0,0,AB724+1)","v":6},{"$f":"E724+F724-AC724","v":-6},0]
[{"$nulls":22},1,0,0,false,5,5,{"$f":"IF(AA725=0,0,AB725+1)","v":6},-6,0]
[{"$nulls":22},1,0,0,false,5,5,6,-6,0]
[{"$nulls":22},1,0,0,false,5,5,6,-6,0]
[{"$nulls":22},1,0,0,false,5,5,6,-6,0]
[{"$nulls":22},1,0,0,false,5,5,6,-6,0]
[{"$nulls":22},1,0,0,false,5,5,6,-6,0]
[{"$nulls":22},1,0,0,false,5,5,6,-6,0]
[{"$nulls":22},1,0,0,false,5,5,6,-6,0]
[{"$nulls":22},1,0,0,false,5,5,6,-6,0]
[{"$nulls":22},1,0,0,false,5,5,6,-6,0]
[{"$nulls":22},1,0,0,false,5,5,6,-6,0]
[{"$nulls":22},1,0,0,false,5,5,6,-6,0]
[{"$nulls":22},1,0,0,false,5,5,6,-6,0]
[{"$nulls":22},1,0,0,false,5,5,6,-6,0]
[{"$nulls":22},1,0,0,false,5,5,6,-6,0]
[{"$nulls":22},1,0,0,false,5,5,6,-6,0]
[{"$nulls":22},1,0,0,false,5,5,6,-6,0]
[{"$nulls":22},1,0,0,false,5,5,6,-6,0]
[{"$nulls":22},1,0,0,false,5,5,6,-6,0]
[{"$nulls":22},1,0,0,false,5,5,6,-6,0]
[{"$nulls":22},1,0,0,false,5,5,6,-6,0]
[{"$nulls":22},1,0,0,false,5,5,6,-6,0]
[{"$nulls":22},1,0,0,false,5,5,6,-6,0]
[{"$nulls":22},1,0,0,false,5,5,6,-6,0]
[{"$nulls":22},1,0,0,false,5,5,6,-6,0]
[{"$nulls":22},1,0,0,false,5,5,6,-6,0]
[{"$nulls":22},1,0,0,false,5,5,6,-6,0]
[{"$nulls":22},1,0,0,false,5,5,6,-6,0]
[{"$nulls":22},1,0,0,false,5,5,6,-6,0]
[{"$nulls":22},1,0,0,false,5,5,6,-6,0]
[{"$nulls":22},1,0,0,false,5,5,6,-6,0]
[{"$nulls":22},1,0,0,false,5,5,6,-6,0]
[{"$nulls":22},1,0,0,false,5,5,6,-6,0]
[{"$nulls":22},1,0,0,false,5,5,6,-6,0]
[{"$nulls":22},1,0,0,false,5,5,6,-6,0]
[{"$nulls":22},1,0,0,false,5,5,6,-6,0]
[{"$nulls":22},1,0,0,false,5,5,6,-6,0]
[{"$nulls":22},1,0,0,false,5,5,6,-6,0]
[{"$nulls":22},1,0,0,false,5,5,6,-6,0]
[{"$nulls":22},1,0,0,false,5,5,6,-6,0]
[{"$nulls":22},1,0,0,false,5,5,6,-6,0]
[{"$nulls":22},1,0,0,false,5,5,6,-6,0]
[{"$nulls":22},1,0,0,false,5,5,6,-6,0]
[{"$nulls":22},1,0,0,false,5,5,6,-6,0]
[{"$nulls":22},1,0,0,false,5,5,6,-6,0]
[{"$nulls":22},1,0,0,false,5,5,6,-6,0]
[{"$nulls":22},1,0,0,false,5,5,6,-6,0]
[{"$nulls":22},1,0,0,false,5,5,6,-6,0]
[{"$nulls":22},1,0,0,false,5,5,6,-6,0]
[{"$nulls":22},1,0,0,false,5,5,6,-6,0]
[{"$nulls":22},1,0,0,false,5,5,6,-6,0]
[{"$nulls":22},1,0,0,false,5,5,6,-6,0]
[{"$nulls":22},1,0,0,false,5,5,6,-6,0]
[{"$nulls":22},1,0,0,false,5,5,6,-6,0]
[{"$nulls":22},1,0,0,false,5,5,6,-6,0]
[{"$nulls":22},1,0,0,false,5,5,6,-6,0]
[{"$nulls":22},1,0,0,false,5,5,6,-6,0]
[{"$nulls":22},1,0,0,false,5,5,6,-6,0]
[{"$nulls":22},1,0,0,false,5,5,6,-6,0]
[{"$nulls":22},1,0,0,false,5,5,6,-6,0]
[{"$nulls":22},1,0,0,false,5,5,6,-6,0]
[{"$nulls":22},1,0,0,false,5,5,6,-6,0]
[{"$nulls":22},1,0,0,false,5,5,6,-6,0]
[{"$nulls":22},1,{"$f":"H788","v":0},{"$f":"IF(D788=1,0,IF(D788>1,2,0))","v":0},{"$f":"IF(D788>1,D788,IF(D788=1,IF(E788+F788+G788<4,0,IF(E788+F788+G788>3,1,0))))","v":false},5,5,6,{"$f":"E788+F788-AC788","v":-6},0]
[{"$nulls":22},1,0,0,false,5,5,{"$f":"IF(AA789=0,0,AB789+1)","v":6},-6,0]
[{"$nulls":22},1,0,0,false,5,5,6,-6,0]
[{"$nulls":22},1,0,0,false,5,5,6,-6,0]
[{"$nulls":22},1,0,0,false,5,5,6,-6,0]
[{"$nulls":22},1,0,0,false,5,5,6,-6,0]
[{"$nulls":22},1,0,0,false,5,5,6,-6,0]
[{"$nulls":22},1,0,0,false,5,5,6,-6,0]
[{"$nulls":22},1,0,0,false,5,5,6,-6,0]
[{"$nulls":22},1,0,0,false,5,5,6,-6,0]
[{"$nulls":22},1,0,0,false,5,5,6,-6,0]
[{"$nulls":22},1,0,0,false,5,5,6,-6,0]
[{"$nulls":22},1,0,0,false,5,5,6,-6,0]
[{"$nulls":22},1,0,0,false,5,5,6,-6,0]
[{"$nulls":22},1,0,0,false,5,5,6,-6,0]
[{"$nulls":22},1,0,0,false,5,5,6,-6,0]
[{"$nulls":22},1,0,0,false,5,5,6,-6,0]
[{"$nulls":22},1,0,0,false,5,5,6,-6,0]
[{"$nulls":22},1,0,0,false,5,5,6,-6,0]
[{"$nulls":22},1,0,0,false,5,5,6,-6,0]
[{"$nulls":22},1,0,0,false,5,5,6,-6,0]
[{"$nulls":22},1,0,0,false,5,5,6,-6,0]
[{"$nulls":22},1,0,0,false,5,5,6,-6,0]
[{"$nulls":22},1,0,0,false,5,5,6,-6,0]
[{"$nulls":22},1,0,0,false,5,5,6,-6,0]
[{"$nulls":22},1,0,0,false,5,5,6,-6,0]
[{"$nulls":22},1,0,0,false,5,5,6,-6,0]
[{"$nulls":22},1,0,0,false,5,5,6,-6,0]
[{"$nulls":22},1,0,0,false,5,5,6,-6,0]
[{"$nulls":22},1,0,0,false,5,5,6,-6,0]
[{"$nulls":22},1,0,0,false,5,5,6,-6,0]
[{"$nulls":22},1,0,0,false,5,5,6,-6,0]
[{"$nulls":22},1,0,0,false,5,5,6,-6,0]
{"$rows_left_out":2064}
{"sheet":"Названия","index":5,"n_rows":28,"n_cols":10,"rows_kept":28,"hidden":true,"merged":[[0,0,0,2],[0,5,0,9]]}
["Имена для идентификации",{"$nulls":4},"Имена для выбора из списков"]
["Модель","Код \nдля заказа","Мощность","Кол-во","Цена","LUNA_DUO_TEC_E","DUO_TEC_COMPACT","Luna_3","Eco_Four","Eco_4s"]
["LUNA DUO-TEC E 1.12",7720022,12,{"$f":"IF(A3=Анкета!$C$8,Анкета!$C$9,0)","v":0},1504,"LUNA DUO-TEC E 1.12","DUO-TEC COMPACT 1.24","LUNA-3 1.310 Fi","ECO Four 1.14","ECO-4s 1.24 F"]
["LUNA DUO-TEC E 1.24",7720023,24,{"$f":"IF(A4=Анкета!$C$8,Анкета!$C$9,0)","v":0},1513,"LUNA DUO-TEC E 1.24","DUO-TEC COMPACT 24","LUNA-3 240 i","ECO Four 1.14 F","ECO-4s 10 F"]
["LUNA DUO-TEC E 1.28",7720024,28,{"$f":"IF(A5=Анкета!$C$8,Анкета!$C$9,0)","v":1},1643,"LUNA DUO-TEC E 1.28","DUO-TEC COMPACT 28","LUNA-3 240 Fi","ECO Four 1.24","ECO-4s 18 F"]
["LUNA DUO-TEC E 24",7720025,24,{"$f":"IF(A6=Анкета!$C$8,Анкета!$C$9,0)","v":0},1620,"LUNA DUO-TEC E 24",null,"LUNA-3 280 Fi","ECO Four 1.24 F","ECO-4s 24"]
["LUNA DUO-TEC E 28",7720026,28,{"$f":"IF(A7=Анкета!$C$8,Анкета!$C$9,0)","v":0},1739,"LUNA DUO-TEC E 28",null,"LUNA-3 310 Fi","ECO Four 24","ECO-4s 24 F"]
["LUNA DUO-TEC E 33",7720027,33,{"$f":"IF(A8=Анкета!$C$8,Анкета!$C$9,0)","v":0},1816,"LUNA DUO-TEC E 33",null,null,"ECO Four 24 F"]
["LUNA DUO-TEC E 40",7720028,40,{"$f":"IF(A9=Анкета!$C$8,Анкета!$C$9,0)","v":0},1957,"LUNA DUO-TEC E 40"]
["DUO-TEC COMPACT 1.24","A7722037",24,{"$f":"IF(A10=Анкета!$C$8,Анкета!$C$9,0)","v":0},1298]
["DUO-TEC COMPACT 24","A7722038",24,{"$f":"IF(A11=Анкета!$C$8,Анкета!$C$9,0)","v":0},1400]
["DUO-TEC COMPACT 28","A7722039",28,{"$f":"IF(A12=Анкета!$C$8,Анкета!$C$9,0)","v":0},1416]
["LUNA-3 1.310 Fi","CSB45531366",31,{"$f":"IF(A13=Анкета!$C$8,Анкета!$C$9,0)","v":0},1226]
["LUNA-3 240 i","CSB45224366",24,{"$f":"IF(A14=Анкета!$C$8,Анкета!$C$9,0)","v":0},1154]
["LUNA-3 240 Fi","CSB45624366",24,{"$f":"IF(A15=Анкета!$C$8,Анкета!$C$9,0)","v":0},1289]
["LUNA-3 280 Fi","CSE45628366",28,{"$f":"IF(A16=Анкета!$C$8,Анкета!$C$9,0)","v":0},1393]
["LUNA-3 310 Fi","CSB45631366",31,{"$f":"IF(A17=Анкета!$C$8,Анкета!$C$9,0)","v":0},1425]
["ECO Four 1.14","CSE46114354",14,{"$f":"IF(A18=Анкета!$C$8,Анкета!$C$9,0)","v":0},849]
["ECO Four 1.14 F","CSE46514354",14,{"$f":"IF(A19=Анкета!$C$8,Анкета!$C$9,0)","v":0},910]
["ECO Four 1.24","CSE46124354",24,{"$f":"IF(A20=Анкета!$C$8,Анкета!$C$9,0)","v":0},861]
["ECO Four 1.24 F","CSE46524354",24,{"$f":"IF(A21=Анкета!$C$8,Анкета!$C$9,0)","v":0},961]
["ECO Four 24","CSE46224354",24,{"$f":"IF(A22=Анкета!$C$8,Анкета!$C$9,0)","v":0},983]
["ECO Four 24 F","CSE46624354",24,{"$f":"IF(A23=Анкета!$C$8,Анкета!$C$9,0)","v":0},1096]
["ECO-4s 1.24 F","7659666",24,{"$f":"IF(A24=Анкета!$C$8,Анкета!$C$9,0)","v":0},848]
["ECO-4s 10 F","7659668",10,{"$f":"IF(A25=Анкета!$C$8,Анкета!$C$9,0)","v":0},845]
["ECO-4s 18 F","7659669",18,{"$f":"IF(A26=Анкета!$C$8,Анкета!$C$9,0)","v":0},880]
["ECO-4s 24","7659762",24,{"$f":"IF(A27=Анкета!$C$8,Анкета!$C$9,0)","v":0},848]
["ECO-4s 24 F","7659670",24,{"$f":"IF(A28=Анкета!$C$8,Анкета!$C$9,0)","v":0},912]

{"sheet":"Логика показа элементов","index":6,"n_rows":17,"n_cols":3,"rows_kept":17,"hidden":true}
["Порядковый номер\nэлемента","Имя файла","Заложенная логика выбора графич элементов"]
[1,"101bertelli-WHB.jpg","Если (Котлы=1 и MLC30=0 и Бойлер=1)"]
[2,"102bertelli&MLC30.jpg","Если (Котлы=1 и MLC30=1 и Бойлер=0)"]
[3,"103bertelli-N-WHB.jpg","Если (Котлы>1 и MLC30=0)"]
[4,"104bertelli-N-WHB&MLC30.jpg","Если (Котлы>1 и MLC30=1)"]
[5,"105-bertelli-WHB&tank.jpg","Если (Котлы=1 и MLC30=0 и Бойлер=1)"]
[6,"106bertelli&tank&MLC30.jpg","Если (Котлы=1 и MLC30=1 и Бойлер=1)"]
[7,"107bertelli-direct.jpg","Если (Котлы=1 и ПрК>0 и ПрК+СмК>1) Или (Котлы>1 и ПрК>0 и ПрК+СмК+Бойлер>1)"]
[8,"107bertelli-direct.jpg","Если (Котлы=1 и ПрК>1 и ПрК+СмК>2) Или (Котлы>1 и ПрК>1 и ПрК+СмК+Бойлер>2)"]
[9,"107bertelli-direct.jpg","Если (Котлы=1 и ПрК>2 и ПрК+СмК>3) Или (Котлы>1 и ПрК>2 и ПрК+СмК+Бойлер>3)"]
[10,"107bertelli-direct.jpg","(Котлы=1 и ПрК=4 и СмК>0) Или (Котлы>1 и ПрК=4 и СмК+Бойлер>0)"]
[11,"108bertelli-direct-final.jpg","Если (Котлы=1 и ПрК>0 и СмК=0) Или Если (Котлы>1 и ПрК>0 и СмК+Бойлер=0)"]
[12,"109bertelli-mix1.jpg","Если (Котлы>1 и СмК=1 и Бойлер=1)"]
[13,"110bertelli-mix1-final.jpg","Если (Котлы=1 и СмК=1) или (Котлы>1 и СмК=1 и Бойлер=0)"]
[14,"111bertelli-mix2.jpg","Если (Котлы>1 и СмК=2 и Бойлер=1) "]
[15,"112bertelli-mix2-final.jpg","Если (Котлы=1 и СмК=2) или (Котлы>1 и СмК=2 и Бойлер=0)"]
[16,"113bertelli-tank.jpg","Если (Котлы>1 и Бойлер=1) "]

{"sheet":"Версии","index":7,"n_rows":4,"n_cols":2,"rows_kept":4,"hidden":true}
["Версия","Изменения"]
[14,"Заменены все рисунки на рисунки высокого качества, задана область печати схемы"]
[15,"Добавлены параметры, сделано автоматическое обновление макросов"]
["v21-04-28","Добавлен титульный лист, добавлен автоматический подбор нужной фотографии котла, добавлен вывод на печать всех листов"]